Linux-2.4.13

Linux-2.4.13 LTP Results

Hardware:
PIII 866MHz, 256 MB ram, 512 MB swap
Distribution:
SuSE 7.2
Statistics:
Cpu user = 56.37%
Cpu system = 18.92%
Memory used = 46.39%
Swap used = 1.29%
Failures:
---test_start---
tag=ftruncate03 stime=1003932949
cmdline="ftruncate03"
contacts=""
analysis=exit
initiation_status="ok"
---test_output---
ftruncate03    1  FAIL  :  ftruncate() fails, File descriptor not open for writing, errno=22, expected errno:13
ftruncate03    2  PASS  :  ftruncate() fails, File descriptor is not valid, errno=9
---execution_status---
duration=0 termination_type=exited termination_id=1 corefile=no
cutime=0 cstime=1
---test_end---
---test_start---
tag=modify_ldt01 stime=1003932963
cmdline="modify_ldt01"
contacts=""
analysis=exit
initiation_status="ok"
---test_output---
modify_ldt01    0  INFO  :  Enter block 1
modify_ldt01    1  FAIL  :  modify_ldt error: unexpected return value 4
modify_ldt01    0  INFO  :  block 1 FAILED
modify_ldt01    0  INFO  :  Exit block 1
modify_ldt01    0  INFO  :  Enter block 2
modify_ldt01    0  INFO  :  block 2 PASSED
modify_ldt01    0  INFO  :  Exit block 2
modify_ldt01    0  INFO  :  block 3 PASSED
modify_ldt01    0  INFO  :  Exit block 3
---execution_status---
duration=0 termination_type=exited termination_id=1 corefile=no
cutime=0 cstime=0
---test_end---
---test_start---
tag=personality02 stime=1003932980
cmdline="personality02"
contacts=""
analysis=exit
initiation_status="ok"
---test_output---
personality02    1  FAIL  :  call failed - errno = 0 - Success
---execution_status---
duration=0 termination_type=exited termination_id=1 corefile=no
cutime=1 cstime=0
---test_end---
---test_start---
tag=recv01 stime=1003932985
cmdline="recv01"
contacts=""
analysis=exit
initiation_status="ok"
---test_output---
recv01      1  PASS  :  bad file descriptor successful
recv01      2  PASS  :  invalid socket successful
recv01      3  FAIL  :  invalid recv buffer ; returned 0 (expected -1), errno 88 (expected 14)
recv01      4  PASS  :  invalid flags set successful
---execution_status---
duration=0 termination_type=exited termination_id=1 corefile=no
cutime=1 cstime=0
---test_end---
---test_start---
tag=sendfile03 stime=1003932987
cmdline="sendfile03"
contacts=""
analysis=exit
initiation_status="ok"
---test_output---
sendfile03    1  PASS  :  sendfile() returned 9 : Bad file descriptor
sendfile03    2  PASS  :  sendfile() returned 9 : Bad file descriptor
sendfile03    3  PASS  :  sendfile() returned 9 : Bad file descriptor
sendfile03    4  FAIL  :  sendfile returned unexpectederrno, expected: 14, got: 9
---execution_status---
duration=0 termination_type=exited termination_id=1 corefile=no
cutime=0 cstime=0
---test_end---
---test_start---
tag=setregid04 stime=1003932992
cmdline="setregid04"
contacts=""
analysis=exit
initiation_status="ok"
---test_output---
setregid04    1  BROK  :  Unexpected signal 11 received.
setregid04    2  BROK  :  Remaining cases broken
setregid04    3  BROK  :  Remaining cases broken
setregid04    4  BROK  :  Remaining cases broken
setregid04    5  BROK  :  Remaining cases broken
setregid04    6  BROK  :  Remaining cases broken
setregid04    7  BROK  :  Remaining cases broken
setregid04    8  BROK  :  Remaining cases broken
setregid04    9  BROK  :  Remaining cases broken
---execution_status---
duration=0 termination_type=exited termination_id=2 corefile=no
cutime=0 cstime=0
---test_end---
---test_start---
tag=shmdt02 stime=1003932995
cmdline="shmdt02"
contacts=""
analysis=exit
initiation_status="ok"
---test_output---
shmdt02     1  FAIL  :  call succeeded unexpectedly
---execution_status---
duration=0 termination_type=exited termination_id=1 corefile=no
cutime=1 cstime=0
---test_end---
---test_start---
tag=sigaction02 stime=1003932995
cmdline="sigaction02"
contacts=""
analysis=exit
initiation_status="ok"
---test_output---
---execution_status---
duration=0 termination_type=signaled termination_id=11 corefile=no
cutime=0 cstime=0
---test_end---
---test_start---
tag=waitpid05 stime=1003933040
cmdline="waitpid05"
contacts=""
analysis=exit
initiation_status="ok"
---test_output---
waitpid05    1  PASS  :  received expected pid.
waitpid05    2  PASS  :  received expected exit number.
waitpid05    3  PASS  :  received expected pid.
waitpid05    4  PASS  :  received expected exit number.
waitpid05    5  PASS  :  received expected pid.
waitpid05    6  FAIL  :  signal error: core dump bit not set for exception number 3
waitpid05    7  PASS  :  received expected exit number.
waitpid05    8  PASS  :  received expected pid.
waitpid05    9  FAIL  :  signal error: core dump bit not set for exception number 4
waitpid05   10  PASS  :  received expected exit number.
waitpid05   11  PASS  :  received expected pid.
waitpid05   12  FAIL  :  signal error: core dump bit not set for exception number 5
waitpid05   13  PASS  :  received expected exit number.
waitpid05   14  PASS  :  received expected pid.
waitpid05   15  FAIL  :  signal error: core dump bit not set for exception number 6
waitpid05   16  PASS  :  received expected exit number.
waitpid05   17  PASS  :  received expected pid.
waitpid05   18  FAIL  :  signal error: core dump bit not set for exception number 8
waitpid05   19  PASS  :  received expected exit number.
waitpid05   20  PASS  :  received expected pid.
waitpid05   21  PASS  :  received expected exit number.
waitpid05   22  PASS  :  received expected pid.
waitpid05   23  FAIL  :  signal error: core dump bit not set for exception number 11
waitpid05   24  PASS  :  received expected exit number.
waitpid05   25  PASS  :  received expected pid.
waitpid05   26  PASS  :  received expected exit number.
waitpid05   27  PASS  :  received expected pid.
waitpid05   28  PASS  :  received expected exit number.
waitpid05   29  PASS  :  received expected pid.
waitpid05   30  PASS  :  received expected exit number.
---execution_status---
duration=0 termination_type=exited termination_id=1 corefile=no
cutime=1 cstime=0
---test_end---
pan reported FAIL

Comments:


Hardware:
Dual PII 300 MHz, 256MB ram, 512MB swap
Distribution:
Red Hat 7.1
Statistics:
Cpu0 user = 30.11%
Cpu0 system = 6.38%
Cpu1 user = 33.98%
Cpu1 system = 14.05%
Memory used = 31.56%
Swap used = 0.97%
Failures:
---test_start---
tag=ftruncate03 stime=1003936683
cmdline="ftruncate03"
contacts=""
analysis=exit
initiation_status="ok"
---test_output---
ftruncate03    1  FAIL  :  ftruncate() fails, File descriptor not open for writing, errno=22, expected errno:13
ftruncate03    2  PASS  :  ftruncate() fails, File descriptor is not valid, errno=9
---execution_status---
duration=0 termination_type=exited termination_id=1 corefile=no
cutime=1 cstime=1
---test_end---
---test_start---
tag=modify_ldt01 stime=1003936700
cmdline="modify_ldt01"
contacts=""
analysis=exit
initiation_status="ok"
---test_output---
modify_ldt01    0  INFO  :  Enter block 1
modify_ldt01    1  FAIL  :  modify_ldt() set invalid errno, expected ENOSYS, got: 14
modify_ldt01    0  INFO  :  block 1 FAILED
modify_ldt01    0  INFO  :  Exit block 1
modify_ldt01    0  INFO  :  Enter block 2
modify_ldt01    0  INFO  :  block 2 PASSED
modify_ldt01    0  INFO  :  Exit block 2
modify_ldt01    0  INFO  :  block 3 PASSED
modify_ldt01    0  INFO  :  Exit block 3
---execution_status---
duration=0 termination_type=exited termination_id=1 corefile=no
cutime=1 cstime=0
---test_end---
---test_start---
tag=personality02 stime=1003936720
cmdline="personality02"
contacts=""
analysis=exit
initiation_status="ok"
---test_output---
personality02    1  FAIL  :  call failed - errno = 0 - Success
---execution_status---
duration=0 termination_type=exited termination_id=1 corefile=no
cutime=0 cstime=1
---test_end---
---test_start---
tag=recv01 stime=1003936726
cmdline="recv01"
contacts=""
analysis=exit
initiation_status="ok"
---test_output---
recv01      1  PASS  :  bad file descriptor successful
recv01      2  PASS  :  invalid socket successful
recv01      3  FAIL  :  invalid recv buffer ; returned 0 (expected -1), errno 88 (expected 14)
recv01      4  PASS  :  invalid flags set successful
---execution_status---
duration=0 termination_type=exited termination_id=1 corefile=no
cutime=0 cstime=0
---test_end---
---test_start---
tag=sendfile03 stime=1003936728
cmdline="sendfile03"
contacts=""
analysis=exit
initiation_status="ok"
---test_output---
sendfile03    1  PASS  :  sendfile() returned 9 : Bad file descriptor
sendfile03    2  PASS  :  sendfile() returned 9 : Bad file descriptor
sendfile03    3  PASS  :  sendfile() returned 9 : Bad file descriptor
sendfile03    4  FAIL  :  sendfile returned unexpectederrno, expected: 14, got: 9
---execution_status---
duration=0 termination_type=exited termination_id=1 corefile=no
cutime=0 cstime=1
---test_end---
---test_start---
tag=shmdt02 stime=1003936737
cmdline="shmdt02"
contacts=""
analysis=exit
initiation_status="ok"
---test_output---
shmdt02     1  FAIL  :  call succeeded unexpectedly
---execution_status---
duration=0 termination_type=exited termination_id=1 corefile=no
cutime=0 cstime=0
---test_end---
---test_start---
tag=sigaction02 stime=1003936738
cmdline="sigaction02"
contacts=""
analysis=exit
initiation_status="ok"
---test_output---
---execution_status---
duration=0 termination_type=signaled termination_id=11 corefile=yes
cutime=1 cstime=0
---test_end---
---test_start---
tag=waitpid12 stime=1003936795
cmdline="waitpid12"
contacts=""
analysis=exit
initiation_status="ok"
---test_output---
waitpid12    1  FAIL  :  Did not find a wait_kid_pid for the fork_kid_pid of 0
waitpid12    2  FAIL  :  fork_kid_pid[0] = 0
waitpid12    3  FAIL  :  fork_kid_pid[1] = 0
waitpid12    4  FAIL  :  fork_kid_pid[2] = 0
waitpid12    5  FAIL  :  fork_kid_pid[3] = 0
waitpid12    6  FAIL  :  fork_kid_pid[4] = 0
waitpid12    7  FAIL  :  fork_kid_pid[5] = 0
waitpid12    8  FAIL  :  fork_kid_pid[6] = 0
waitpid12    9  FAIL  :  fork_kid_pid[7] = 0
waitpid12   10  FAIL  :  wait_kid_pid[0] = 5074
waitpid12   11  FAIL  :  wait_kid_pid[1] = 5073
waitpid12   12  FAIL  :  wait_kid_pid[2] = 5072
waitpid12   13  FAIL  :  wait_kid_pid[3] = 0
waitpid12   14  FAIL  :  wait_kid_pid[4] = 0
waitpid12   15  FAIL  :  wait_kid_pid[5] = 0
waitpid12   16  FAIL  :  wait_kid_pid[6] = 0
waitpid12   17  FAIL  :  wait_kid_pid[7] = 0
waitpid12   18  FAIL  :  wait_kid_pid[8] = 0
waitpid12   19  FAIL  :  wait_kid_pid[9] = 0
waitpid12   20  FAIL  :  wait_kid_pid[10] = 0
waitpid12   21  FAIL  :  wait_kid_pid[11] = 0
waitpid12   22  FAIL  :  wait_kid_pid[12] = 0
waitpid12   23  FAIL  :  wait_kid_pid[13] = 0
waitpid12   24  FAIL  :  wait_kid_pid[14] = 0
waitpid12   25  FAIL  :  wait_kid_pid[15] = 0
waitpid12   26  FAIL  :  wait_kid_pid[16] = 0
waitpid12   27  FAIL  :  wait_kid_pid[17] = 0
waitpid12   28  FAIL  :  Did not find a wait_kid_pid for the fork_kid_pid of 0
waitpid12   29  FAIL  :  fork_kid_pid[0] = 0
waitpid12   30  FAIL  :  fork_kid_pid[1] = 0
waitpid12   31  FAIL  :  fork_kid_pid[2] = 0
waitpid12   32  FAIL  :  fork_kid_pid[3] = 0
waitpid12   33  FAIL  :  fork_kid_pid[4] = 0
waitpid12   34  FAIL  :  fork_kid_pid[5] = 0
waitpid12   35  FAIL  :  fork_kid_pid[6] = 0
waitpid12   36  FAIL  :  fork_kid_pid[7] = 0
waitpid12   37  FAIL  :  wait_kid_pid[0] = 5074
waitpid12   38  FAIL  :  wait_kid_pid[1] = 5073
waitpid12   39  FAIL  :  wait_kid_pid[2] = 5072
waitpid12   40  FAIL  :  wait_kid_pid[3] = 0
waitpid12   41  FAIL  :  wait_kid_pid[4] = 0
waitpid12   42  FAIL  :  wait_kid_pid[5] = 0
waitpid12   43  FAIL  :  wait_kid_pid[6] = 0
waitpid12   44  FAIL  :  wait_kid_pid[7] = 0
waitpid12   45  FAIL  :  wait_kid_pid[8] = 0
waitpid12   46  FAIL  :  wait_kid_pid[9] = 0
waitpid12   47  FAIL  :  wait_kid_pid[10] = 0
waitpid12   48  FAIL  :  wait_kid_pid[11] = 0
waitpid12   49  FAIL  :  wait_kid_pid[12] = 0
waitpid12   50  FAIL  :  wait_kid_pid[13] = 0
waitpid12   51  FAIL  :  wait_kid_pid[14] = 0
waitpid12   52  FAIL  :  wait_kid_pid[15] = 0
waitpid12   53  FAIL  :  wait_kid_pid[16] = 0
waitpid12   54  FAIL  :  wait_kid_pid[17] = 0
waitpid12   55  FAIL  :  Did not find a wait_kid_pid for the fork_kid_pid of 0
waitpid12   56  FAIL  :  fork_kid_pid[0] = 0
waitpid12   57  FAIL  :  fork_kid_pid[1] = 0
waitpid12   58  FAIL  :  fork_kid_pid[2] = 0
waitpid12   59  FAIL  :  fork_kid_pid[3] = 0
waitpid12   60  FAIL  :  fork_kid_pid[4] = 0
waitpid12   61  FAIL  :  fork_kid_pid[5] = 0
waitpid12   62  FAIL  :  fork_kid_pid[6] = 0
waitpid12   63  FAIL  :  fork_kid_pid[7] = 0
waitpid12   64  FAIL  :  wait_kid_pid[0] = 5074
waitpid12   65  FAIL  :  wait_kid_pid[1] = 5073
waitpid12   66  FAIL  :  wait_kid_pid[2] = 5072
waitpid12   67  FAIL  :  wait_kid_pid[3] = 0
waitpid12   68  FAIL  :  wait_kid_pid[4] = 0
waitpid12   69  FAIL  :  wait_kid_pid[5] = 0
waitpid12   70  FAIL  :  wait_kid_pid[6] = 0
waitpid12   71  FAIL  :  wait_kid_pid[7] = 0
waitpid12   72  FAIL  :  wait_kid_pid[8] = 0
waitpid12   73  FAIL  :  wait_kid_pid[9] = 0
waitpid12   74  FAIL  :  wait_kid_pid[10] = 0
waitpid12   75  FAIL  :  wait_kid_pid[11] = 0
waitpid12   76  FAIL  :  wait_kid_pid[12] = 0
waitpid12   77  FAIL  :  wait_kid_pid[13] = 0
waitpid12   78  FAIL  :  wait_kid_pid[14] = 0
waitpid12   79  FAIL  :  wait_kid_pid[15] = 0
waitpid12   80  FAIL  :  wait_kid_pid[16] = 0
waitpid12   81  FAIL  :  wait_kid_pid[17] = 0
waitpid12   82  FAIL  :  Wrong number of children waited on for pid = 0
waitpid12   83  FAIL  :  Expected 4 got 17
waitpid12    0  INFO  :  Test FAILED
waitpid12    1  FAIL  :  child returned bad status
waitpid12    0  INFO  :  waitpid12 FAILED
---execution_status---
duration=0 termination_type=exited termination_id=1 corefile=no
cutime=54 cstime=0
---test_end---
pan reported FAIL

Comments: