Linux -2.5.59 LTP Results

LTP version:
ltp-cvs-20030206(downloaded from CVS tree)

Hardware:
PIII 866 MHz, 256 MB ram

Distribution:
RedHat 7.3

Statistics:
Cpu user = 62.56%
Cpu system = 19.14%
Memory used = 45.30%
Swap used = 1.69%
Failures:
create_module01    1  FAIL  :  create_module() failed errno=38 : Function not implemented
create_module02    1  FAIL  :  Unexpected results for non-superuser ; returned -1 (expected -1), errno 38 (expected 1)
create_module02    2  FAIL  :  Unexpected results for module name outside the  program's  accessible  address space ; returned -1 (expected -1), errno 38 (expected 14)
create_module02    3  FAIL  :  Unexpected results for NULL module name ; returned -1 (expected -1), errno 38 (expected 14)
create_module02    4  FAIL  :  Unexpected results for null terminated module name ; returned -1 (expected -1), errno 38 (expected 22)
create_module02    6  FAIL  :  Unexpected results for insufficient module size ; returned -1 (expected -1), errno 38 (expected 22)
create_module02    7  FAIL  :  Unexpected results for long module name ; returned -1 (expected -1), errno 38 (expected 36)
create_module02    8  FAIL  :  Unexpected results for large module size ; returned -1 (expected -1), errno 38 (expected 12)
delete_module02    2  FAIL  :  Unexpected results for null terminated module name ; returned -1 (expected -1), errno 2 (expected 22)
delete_module02    4  FAIL  :  Unexpected results for long module name ; returned -1 (expected -1), errno 2 (expected 36)
flock03     2  FAIL  :  Child: Unable to relock file after unlocking, errno 11
flock03     2  FAIL  :  flock03 Failed
nanosleep02    1  FAIL  :  Remaining sleep time 4001000 usec doesn't match with the expected 3999422 usec time
nanosleep02    1  FAIL  :  child process exited abnormally
personality02    1  FAIL  :  call failed - errno = 0 - Success
pread02     2  FAIL  :  pread() returned 0, expected -1, errno:22
pwrite02    2  FAIL  :  specified offset is -ve or invalid, unexpected errno:27, expected:22
query_module01    1  FAIL  :  query_module() failed for module name: NULL, which: 0 ; returned -1 (expected 0), errno 38 (expected 0)
query_module02    1  FAIL  :  Unexpected results for non-existing module ; returned -1 (expected -1), errno 38 (expected 2)
query_module02    2  FAIL  :  Unexpected results for invalid which argument ; returned -1 (expected -1), errno 38 (expected 22)
query_module02    3  FAIL  :  Unexpected results for NULL module name and valid which argument ; returned -1 (expected -1), errno 38 (expected 22)
query_module02    4  FAIL  :  Unexpected results for null terminated (zero lenght) module name ; returned -1 (expected -1), errno 38 (expected 22)
query_module02    5  FAIL  :  Unexpected results for long module name ; returned -1 (expected -1), errno 38 (expected 36)
query_module03    1  FAIL  :  Unexpected results for module name argument outside program's accessible address space ; returned -1 (expected -1), errno 38 (expected 14)
query_module03    2  FAIL  :  Unexpected results for return size argument outside program's accessible address space ; returned -1 (expected -1), errno 38 (expected 14)
setitimer01    1  FAIL  :  old timer value is not equal to expected value
/root/ltp-cvs-20030206/testcases/bin/syslog01 FAILED
/root/ltp-cvs-20030206/testcases/bin/syslog02 FAILED
/root/ltp-cvs-20030206/testcases/bin/syslog03 FAILED
/root/ltp-cvs-20030206/testcases/bin/syslog04 FAILED
syslogtst    1  FAIL  :  Cannot move /var/log/messages. Setup failed...exiting...
/root/ltp-cvs-20030206/testcases/bin/syslog05 FAILED
/root/ltp-cvs-20030206/testcases/bin/syslog07 FAILED
/root/ltp-cvs-20030206/testcases/bin/syslog08 FAILED
/root/ltp-cvs-20030206/testcases/bin/syslog09 FAILED
/root/ltp-cvs-20030206/testcases/bin/syslog10 FAILED
sem02: FAIL

Comments:

Hardware:
Dual Athlon 1.2GHz, 512 MB ram, 8032 MB swap

Distribution:
SuSE 8.0

Statistics:
Cpu user = 28.96%
Cpu system = 20.89%
Memory used = 36.91%
Swap used = 3.99%
Failures:
create_module01    1  FAIL  :  create_module() failed errno=38 : Function not implemented
create_module02    1  FAIL  :  Unexpected results for non-superuser ; returned -1 (expected -1), errno 38 (expected 1)
create_module02    2  FAIL  :  Unexpected results for module name outside the  program's  accessible  address space ; returned -1 (expected -1), errno 38 (expected 14)
create_module02    3  FAIL  :  Unexpected results for NULL module name ; returned -1 (expected -1), errno 38 (expected 14)
create_module02    4  FAIL  :  Unexpected results for null terminated module name ; returned -1 (expected -1), errno 38 (expected 22)
create_module02    6  FAIL  :  Unexpected results for insufficient module size ; returned -1 (expected -1), errno 38 (expected 22)
create_module02    7  FAIL  :  Unexpected results for long module name ; returned -1 (expected -1), errno 38 (expected 36)
create_module02    8  FAIL  :  Unexpected results for large module size ; returned -1 (expected -1), errno 38 (expected 12)
delete_module02    1  FAIL  :  Unexpected results for non-existing module ; returned -1 (expected -1), errno 38 (expected 2)
delete_module02    2  FAIL  :  Unexpected results for null terminated module name ; returned -1 (expected -1), errno 38 (expected 22)
delete_module02    3  FAIL  :  Unexpected results for module name outside program's accessible address space ; returned -1 (expected -1), errno 38 (expected 14)
delete_module02    4  FAIL  :  Unexpected results for long module name ; returned -1 (expected -1), errno 38 (expected 36)
delete_module02    5  FAIL  :  Unexpected results for non-superuser ; returned -1 (expected -1), errno 38 (expected 1)
flock03     2  FAIL  :  Child: Unable to relock file after unlocking, errno 11
flock03     2  FAIL  :  flock03 Failed
nanosleep02    1  FAIL  :  Remaining sleep time 4001000 usec doesn't match with the expected 3998649 usec time
nanosleep02    1  FAIL  :  child process exited abnormally
personality02    1  FAIL  :  call failed - errno = 0 - Success
pread02     2  FAIL  :  pread() returned 0, expected -1, errno:22
pwrite02    2  FAIL  :  specified offset is -ve or invalid, unexpected errno:27, expected:22
query_module01    1  FAIL  :  query_module() failed for module name: NULL, which: 0 ; returned -1 (expected 0), errno 38 (expected 0)
query_module02    1  FAIL  :  Unexpected results for non-existing module ; returned -1 (expected -1), errno 38 (expected 2)
query_module02    2  FAIL  :  Unexpected results for invalid which argument ; returned -1 (expected -1), errno 38 (expected 22)
query_module02    3  FAIL  :  Unexpected results for NULL module name and valid which argument ; returned -1 (expected -1), errno 38 (expected 22)
query_module02    4  FAIL  :  Unexpected results for null terminated (zero lenght) module name ; returned -1 (expected -1), errno 38 (expected 22)
query_module02    5  FAIL  :  Unexpected results for long module name ; returned -1 (expected -1), errno 38 (expected 36)
query_module03    1  FAIL  :  Unexpected results for module name argument outside program's accessible address space ; returned -1 (expected -1), errno 38 (expected 14)
query_module03    2  FAIL  :  Unexpected results for return size argument outside program's accessible address space ; returned -1 (expected -1), errno 38 (expected 14)
mem01       1  FAIL  :  malloc - alloc of 2428MB failed
sem02: FAIL

Comments: